Assertionfailederror

assertionfailederror 12. Once in a while, though, assertTrue () comes in handy. 0 K8s 1. com In this article. Before we can write assertions with AssertJ, we have to get the required dependencies. this is the simplest example of assertion and this is how test case with assertion looks like. In the address bar (probably the one at the top if you're using defaults in Internet Explorer) to the left of the address are two boxes - one with two blue arrows and one with a red x. com JUnit is a simple, open source framework to write and run repeatable tests. fail(Assert. * Asserts that a condition is false. runTest AssertionFailedError is an initial draft for a common base class for test-related AssertionErrors. This Presentation will help developers to understand need of Unit Testing, How can we do unit testing with the help of Junit. In very old junit, AssertionFailedError extends AssertionError was available. why. This could have been caused by an action element  27 Oct 2015 AssertionFailedError">junit. lang. AssertionFailedError: expected:<2883> but was:<2883>. AssertionFailedError: null . api. taskdefs. java:47) at junit. gen5. drush. at org. framework. Core. AssertionFailedError: No tests found in androidstudio. AssertionFailedError: Forked Java VM exited abnormally. Assert. AppError Hi All, I am facing the similar kind of problem. 2. PHPUnit2_TextUI_ResultPrinter Prints the result of a TextUI TestRunner run. AccessTest. 0 K8s 1. Assert. UIComponentTag. Getting the Required Dependencies. jar に入っている assertTimeoutはテスト対象の処理が終わるまで待ち、終わってからAssertionFailedErrorを発生させる。 assertTimeoutPreemptivelyは、タイムアウト時間になったらすぐに(テスト対象の処理が終わるのを待たずに)AssertionFailedErrorを発生させる。 Android APIs. Object: clone, equals, finalize, getClass, hashCode, notify, notifyAll, wait, wait, wait AssertionFailedError(java. junit. Assert assertion is hit but has no visible effects. . 23. “Is my Phone Network Locked?” should be the first and most important question you should ask yourself before thinking of switching Network Providers. TestCase. framework. It’s simple and it solves the test case. 1 ― 2004/12/23 AssertJ 테스트 코드 작성 시 가독성이 뛰어나고 상세한 에러 메시지를 제공해주는 라이브러리입니다. 5. To assure ourselves that assertThrows()  2018年9月14日 AssertionFailedError: Accessibility should have been enabled by the test AssertionFailedError: There should be one speaking service. RunClassThread. *; public class TestJunit1 { @Test public void testAdd() { //test data int num = 5; String temp = null; String str = "Junit is working fine"; //check for equality assertEquals("Junit is working fine", str DERBY-4540 'AssertionFailedError' in 'store. fail(Assert. drush. While setting up a Linux system recently, I wanted to know how to ensure that dependencies for services and other units were up and running before those dependent services and units start. DDD や "真の" クリーンアーキテクチャは, Web 業界における大抵の現場ではオーバースペックだし,導入しても全員がついてこれるとは限らない [ホームへもどる] [JUnit 実践講座 へもどる] JUnit 実践講座 - Tips集. Add the JUni 5 jupiter engine, and define the useJUnitPlatform() like the following: Service Messages. [email protected] What is mockpp. IllegalArgumentException]  20 Nov 2017 AssertionFailedError: No tests found in at junit. impl  4 авг 2008 AssertionFailedError / Java / Добрый день!Кто-нибудь знает как профиксить исключение в testcase? Хотелось-бы увидеть нормальный  To protect code from invalid usage in Release builds, see preconditionFailure(_: file:line:) . The rules consist of four types, i. uninstall the Selenium server and reinstall it, then try and and use the selenium standalone sever which contains both the java client server and selenium server 2. public class Assert extends junit. Throws: junit. framework. 0: Used By: 88 artifacts: Central (9) In this tutorial I want to give you a quickest start with the Karate Testing Automation Framework. framework. 0, Mockito supports mocking static methods. PHPUnit What is PHPUnit? In general, PHPUnit is a unit testing framework for the PHP language. AssertionFailedError expected: Hi, Can some one please let us know when do we get this error, what is wrong to get this error in  AssertionFailedError: No tests found in Caso1 at junit. The archive that included the HelloJazz example's source already had the dependencies imported, so I didn't have to import anything. framework. framework. jupiter. framework. Write a program to implement the dequeue (double-ended queue) data structure using linked list. 17. 1 K8s 1. Reflection assert automatically excludes transient variables from comparison. framework. . framework. Lets just fix it: private int factorial(int i) { return 1; } Hurray our test is now running green! Clean up code. Method. framework. When to use assertNotNull () method or assertion When we want to assert that an object is not null we can use the assertNotNull assertion. junit. util. * * <p>The thrown exception instance is returned. TestCase which indicates that public void method to which it is attached can be executed as a test Case. AssertionFailedError: Method "testValidatePanelistIDHwid" not found at junit. 1. reflect. If the specified object is an instance of Throwable, it becomes the cause of the newly constructed assertion error. lang. AssertionFailedError这个错一般是Test命名前面没有加test字样。没有加test字样如果能运行也有可能test时会很慢。半天没有出现输出结果。 In my opinion, the most useful assertion in JUnit is assertEquals (). framework. junit. com -- New Implementation trait for class JUnitSuite, which represents a suite of tests that can be run with either JUnit or ScalaTest. notice. Below is a list of questions asked frequently during technical interviews on the topic of Spring security. AssertionFailedError(System. Attendees; CalendarContract. lang. IllegalArgumentException这个异常是什么意思啊,如何解决 我来答 junit. e. lang. For details and usage of spring security concepts in real-world examples, please check-out these posts: Secure a REST Service Basic HTTP Authentication What is Spring Security? CactusStrutsTestCase is an extension of the Cactus ServletTestCase base class that provides additional methods to aid in testing Struts Action objects. fail( Assert. TestSuite$1. io. at net. opentest4j. Ok lets expand 1! should also be 1. tools. 15. xpl. AssertionFailedError: expected:<2> but was:<1> Expected :2 Actual :1 Expected: 2. sf. The main idea behind this framework is that every developer must be able to find mistakes and errors Try this and see if it works. 5. stat. [email protected] A set of assert methods (primarly testing the negative assertion of the correspondent methods found in the junit. u-strasbg. We've got the following error: junit. “Is my Phone Network Locked?” should be the first and most important question you should ask yourself before thinking of switching Network Providers. wichina. AssertionFailedError: No tests found in ${パッケージ名} at and… 29 Sep 2020 AssertionFailedError: Expected java. RunTargetTask. . Note that in JUnit 5 all JUnit 4 assertion methods are moved to org. Assert. framework. Unitils assertReflectionEquals (expectedObject, actualObject) loops over all fields in both objects and compares their values using reflection. com is the number one paste tool since 2002. Method Summary; static void: assertEquals(boolean expected, boolean actual) Asserts that two booleans are equal. execution. java:153) We are running integration test for a webservice. slf4j. String, however attribute 'itemCount' RESOLVED (nobody) in Firefox for Android - General. To be processed by TeamCity, they need to be written to the standard output stream of the build, that is printed or echoed from a build step. NETFramework的适当版本的说明,请与应用程序发行者联系。 こんにちは横部です。システムの構成変更やバージョンアップによって、今まで正常に動いていたテストコードが全部エラーを吐き出し始めた・・・なんてことはよくあります。ちょっとした変更であれば原因究明と修正は 蓝花 2011年9月 Linux/Unix社区大版内专家分月排行榜第三 2010年12月 Linux/Unix社区大版内专家分月排行榜第三 2010年11月 Linux/Unix社区大版内专家分月排行榜第三 2010年9月 C/C++大版内专家分月排行榜第三 求助:junit. 2_30" Java(TM) 2 Runtime Environment, Standard Edition (build 1. com: I could found the only usage org. java:1729)' on SUSE Linux / IBM JIT - r9. testScanToken(Unknown Source), 0. samples. Moreover, we can capture the thrown exception to check for further information like the error message. 1) skipping to change at line 19 skipping to change at Thanks Chris, I haven't tried testing in Eclipse. Assert. lang. framework. 1. Viewed 214 times -1. execute(RunTargetTask. framework. Eclipse Project Release Notes. elements. 0 K8s 1. junit. AssertionFailedError: Exception in constructor: (java. AssertionFailedError这个错一般是Test命名前面没有加test字样。 没有加test字样如果能运行也有可能test时会很慢。半天没有出现输出结果。 格式:test + (你要的命名) Mailing Lists. com and asserting that title should be equals to Google. lang. MockStrutsTestCase is an extension of the base JUnit testcase that provides additional methods to aid in testing Struts Action objects. AssertionFailedError: No tests found in <path of test class> I am using JUnit 4 for testing. We only have the "AssertionFailedError" in the console, and we can see that the expected and the actual values were not the same. JUnit 5 introduced a new way of testing for expected exceptions, which is an… See full list on technetexperts. etc. Unless otherwise noted, a failed assertion will throw an AssertionFailedError or a subclass thereof. 18. no data. accounts; android. Assert. 30319有关如何获取. FailingTest What is mockpp. xsl script from the docs repository and fix the docs and release builds so that they don't build monohtml versions of the Derby manuals. MyTest 以前JUnit3を使っていた時はテストメソッドに"test"とつける必要がありましたが、 JUnit4は"@Test"アノテーションをつけるだけでテストメソッドと認識してくれたような気がするのですが・・・ Contact Information #3940 Sector 23, Gurgaon, Haryana (India) Pin :- 122015. There are a few different ways to test that a constructor or other unit in a Java program throws a certain exception. You can also do so by Clicking on F5 or clicking on View / Refresh. java in C:\>JUNIT_WORKSPACE. Similarly, if all assertions of a test pass, the test will pass. lang. 0 K8s 1. Created: Wed Jul 18 16:10:35 IST 2012  Chart 25, 1, 1, 2, 14, 12, 0, 2, 6, 4, 7, 6, AssertionFailedError. 2. In addition to a message and a cause this class stores the expected and actual values of an assertion using the ValueWrapper type. 0 K8s 1. junit. jar に入っている java. View results here -> [1]http://proxenet. To prevent identity theft and fraud, devices bought from Verizon are locked and cannot be used on another carrier's network for the first 60 days after purchase. Am 10. AssertionFailedError: expected: <true> but was: <false> А SpringRunner же нужен для автовайринга. junit. . This is testing the return of a primary key id. 1. The data were collected through 3 steps, including generating crashing faults, extracting features, and labeling crashing fault residence. テスト対象クラス用の 本記事は2001年に執筆されたものです。JDBC全般の最新情報は@IT Java Solutuionのカテゴリ「DB連携」をご参照ください。 この記事では「 【Java入門】リフレクションでメソッドの実行、フィールドの変更 」といった内容について、誰でも理解できるように解説します。この記事を読めば、あなたの悩みが解決するだけじゃなく、新たな気付きも発見できることでしょう。お悩みの方はぜひご一読ください。 11. These source code samples are taken from different open source projects JCGs (Java Code Geeks) is an independent online community focused on creating the ultimate Java to Java developers resource center; targeted at the technical architect, technical team lead (senior developer), project manager and junior developers alike. JUnitResultFormatter This java examples will help you to understand the usage of junit. It is an instance of the xUnit architecture for unit testing frameworks. Junit 5 : AssertionFailedError: expected: <true> but was: <false> Ask Question Asked 2 months ago. Assertions Class. framework. junit. java: 50) at junit. 8. 2_30-b04, mixed mode) Red Hat Enterprise Linux Server release 5. 2; 1. Open Test Alliance for the JVM License: Apache 2. Assert. framework. void, addFailure(Test test, AssertionFailedError t) A failure occurred. Il entre ainsi dans la catégorie des outils de test dynamique (à l'inverse des tests JUnitで単体テストを行っていたところ、前日まで正常に動いてたメソッドで急にinitializationErrorが出てしまいました。 以下、経緯と解決策の覚書きです。 発生事象 Eclipseを使用し、JUnitテストを実行 如何解决“. */. Let’s take a closer look at the use cases of these methods. String) AssertionFailedError(IntPtr, JniHandleOwnership) A constructor used when creating managed representations of JNI objects; called by the runtime. AssertionErrors. These are the top rated real world Java examples of junit. mockpp is a platform independent generic unit testing framework for C++. 1 introduced a mechanism to grant special privileges for APIs relevant to the owners of universal integrated circuit card (UICC) apps. language. AssertionFailedError: Num of log item should add DERBY-5586 Remove the fo2html. CSDN问答为您找到junit. I don’t see any reason to clean up the code yet. 3. opentest4j. logic. void, addError(Test test, java. AssertionFailedError() 任意のメッセージを設定しないコンストラクタです。 AssertionFailedError(java. fail(Assert. Subscribe. AssertionFailedError: View is null and can therefore not be clicked! 10-07 06:42:15. AssertionFailedError: 20 INFO TEST-UNEXPECTED-FAIL | testShareLink | Exception caught Learn to use String. 18. Method. 그래서 인터넷을 찾아봤더니. AssertionFailedError: expected:<2> but was:<1> Expected :2 Actual :1 Expected: 2. framework. framework. framework. Instead, create an instance of the data classes with the expected values and use it directly in a single equality assertion. You can track all active APARs for this component. netbeans. ここでは、例題を用いJUnitの基本操作ついて解説します。JUnitでのテストはJUnitのTestCaseクラスを継承したテストプログラムを作成し、それを実行することで行います。 static void fail(String message, Object expected, Object actual) { throw new AssertionFailedError(message, expected, actual); getLogin(); assertOk(login); } catch ( Exception e) { AssertionFailedError afe=new PreorderException e) { throw new AssertionFailedError((message == null ? AssertionFailedError: No tests found. Posted by: admin February 23, 2018 Leave a comment. impl. TL;DR. java:36) org. 984 I/TestRunner( 3771): junit. . DerbyNetNewServerTest)junit. JUnitSuite is a class, not a trait, to minimize compile time given there is a slight compiler overhead to mixing in traits compared to extending classes. exe File:\\Src\\NCSRuleReader. lang. class GLOBALS Method Summary <static> void: __CAF. Let's see its advantage and example of assertion in java. There are already many getting started tutorials for Karate on the net, but if you want to develop e. This article shows you how to add JUnit 5 in a Gradle project. Assert. awesome incremental search Open Test Alliance for the JVM License: Apache 2. Last updated 2014-01-07. framework. inc b/src/modules/contrib/xmlsitemap/xmlsitemap. isBlank() method to determine is a given string is blank or empty or contains only white spaces. tests. fail(  19 Jun 2013 AssertionFailedError> testIncreaseCapacity(org. framework. 4. Junit5中新添加了对方法抛出异常的断言Assertions类中的assertThrows()和assertDoesNotThrow(),使用此方法可以对被测试方法抛出的异常进行断言测试,而在junit4中的对异常进行断言实现相对来说比较麻烦的。 1. Test at junit. You can rate examples to help us improve the quality of examples. テストを書きやすくする、あるいはテストの実行結果の表示方法を変更するなど、 PHPUnit はさまざまな方法で拡張することができます。 JUnit 4. These examples are extracted from open source projects. framework. 2016 um 13:10 schrieb Anna Kozlova notifications. AssertionFailedError() C:Android. AssertionFailedError expected: Hi, Can some one please let us know when do we get this error, what is wrong to get this error in  25 Feb 2018 AssertionFailedError: Not yet implemented at com. * @param source test result loaded through a different classloader * @param destination test result reported to the outside framework * @param test initial test used for bootstrapping the integration framework * @return cloned test result */ public static TestResult cloneTestResults(OsgiTestInfoHolder source public AssertionFailedError(String message) Overview : Package Class : Use : Tree : Deprecated : Index : Help PREV CLASS NEXT CLASS: FRAMES NO FRAMES public class MockStrutsTestCase extends junit. The article also includes information about how to resolve these issues and errors. NoClassDefFoundError的)) - IT屋-程序员软件开发技术分享社区 assertTimeoutはテスト対象の処理が終わるまで待ち、終わってからAssertionFailedErrorを発生させる。 assertTimeoutPreemptivelyは、タイムアウト時間になったらすぐに(テスト対象の処理が終わるのを待たずに)AssertionFailedErrorを発生させる。 org. framework. framework. 8. AssertionFailedError: [Frodo's age] Expecting: <33> to be equal to: <44> but was not. The one with two blue arrows will refresh your screen. kodulf. assertFalse(boolean condition) 用于判断一个条件为假 junit. Note that each node in this dequeue should store an integer. It's goal is to facilitate developing unit tests in the spirit of Mock Objects for Java, EasyMock and jMock. isBlank() method has been added in Java 11. AssertionFailedError: No tests found in xx. Almost every example out there about JUnit and Gradle is still using the old dependencies or Groovy Gradle syntax, so let’s try to migrate a Groovy build using JUnit Platform to Kotlin DSL, specifically, based on examples about how to extend Gradle’s Starting with version 3. Gradle 5+ has been out for a while now and with that we finally got the ability to write our Gradle scripts in Kotlin. framework. runTest(TestSuite. 9. runTest(TestSuite. By default the parser will try to resolve the location of Schema definition files via a schemaLocation attribute if it is present in the piece of XML or it will try to open the Schema's URI as an URL and read from it. framework. framework. Features of Strikt Strikt is an assertion library written in Kotlin. A question that is frequently asked on the jMock 1 users' mailing list 2 is "how do I use mock objects to test a class that spawns new threads"? testStartWithPrintWriter(org. 4. TestCase. java. Purpose: The exception thrown when an assertion fails. framework. , 2019). org. This class provides some customized behavior beyond the basics of TestCase to support testing of I/O driven programs and flexible/fuzzy comparison of strings. 标题:Maven中junit. junit. Junit5中新添加了对方法抛出异常的断言Assertions类中的assertThrows()和assertDoesNotThrow(),使用此方法可以对被测试方法抛出的异常进行断言测试,而在junit4中的对异常进行断言实现相对来说比较麻烦的。 JUnit - API JUnit 中的重要的 API JUnit 中的最重要的程序包是 junit. framework. com See full list on baeldung. framework. AlarmClock; BlockedNumberContract; BlockedNumberContract. ant. TestCase. However I am using RC1. 0 K8s 1. exe-. AssertionFailedError has no public constructor. framework. framework. stat. You can vote up the ones you like or vote down the ones you don't like, and go to the original project or source file by following the links above each example. AssertionFailedError: Exception in constructor: testSave (java. junit. </p> * * <p>Use {@code expectThrows} if you want to perform additional checks on the exception instance. lang. Returns a BigDecimal whose scale is the specified value, and whose value is numerically equal to thi Java AssertionFailedError - 7 examples found. framework. A question that is frequently asked on the jMock 1 users' mailing list 2 is "how do I use mock objects to test a class that spawns new threads"? AssertDoesNotThrowAssertionsTests. Anfänglich wurde JUnit von Erich Gamma und Kent Beck entwickelt. AssertionFailedError: expected:<true> but was:<false> 改成Assert. junit. Assert. framework. Request() <static> void: __GLOBAL. Hey guys, I've been having this trouble with the error from my code, debugging doesn'  public static void assertClassAssignability(Class source, Class target) throws junit. AssertionFailedError: Method "testValidatePanelistIDHwid" not found at junit. 14. framework. Unit testing comes into picture at the developers’ level; it is the testing of single entity (class or method). Write test This Presentation will help developers to understand need of Unit Testing, How can we do unit testing with the help of Junit. Lang. net framework初始化错误”问题,在wi7上运行一些程序的时候,有时候会弹出一个关于“xxxx. 2. assertNotNull (Object object) Asserts that an object isn't null. Questions: I’m using AndroidJUnitRunner with Espresso. framework. Test; import static org. This article explains how to use this new feature for Java and Kotlin. 0): AssertDoesNotThrowAssertionsTests. framework. Test at junit. JavaのリフレクションAPIを利用することで、メタデータにアクセスできます。 java. 4. file. AssertionFailedError  an AssertionFailedError. 0. Gradle + JUnit 5. etframework初始化错误”对话框:‘若要运行此应用程序,您必须首先安装. Have you ever tried to write unit tests for a class that does some data munging on a database? JUnit 5 and Gradle. Testing Multithreaded Code. Its single parameter form takes a Boolean, its 2-parameter form takes an visual studio 2017 version 15. assertionfailederror相关问题答案,如果想了解更多关于junit. 2_30-b04) Java HotSpot(TM) Client VM (build 1. Becuase it is a JSF 1. . 1. framework. lang. 3. } /**. AssertionFailedError: No tests found in gameMechanics. faces. awesome incremental search While setting up a Linux system recently, I wanted to know how to ensure that dependencies for services and other units were up and running before those dependent services and units start. AssertionFailedError: expected:<2883> but was:<2883> at junit. TestEventQueueBackingStoreFactory): Unexpected exception  AssertionFailedError extended by Same as ServletExceptionWrapper except that this exception class extends JUnit AssertionFailedError so that JUnit will print   AssertionFailedError: Unexpected ERROR logged: Writing of table to file encountered error: IOException: Workflow temp directory  27 Oct 2015 AssertionFailedError">junit. junit. 11. We can do this by declaring the assertj-core dependency (version 3. framework. FileNotFoundException: C:\XXXXXXXXXXXXXXXXXXXXXX (指定されたファイルが見つかりません。 -cp オプションでテストで使用する依存関係(JUnit5 以外)をクラスパスに追加する。. Overview In this article, we'll explain why using null to represent the absence of a return value is a bad approach. 338 Note: failures are anticipated and checked for with assertions while errors are unanticipated. CalendarAlerts junit. webapp. 7. NETFramework的以下版本之一:v4. unittestdemo2. 03. assertTrue(boolean condition) 用于判断一个条件为真,如果为false会抛出异常 2. Service messages are specially constructed pieces of text that pass commands/information about the build from the build script to the TeamCity server. framework. AssertionFailedError. By default the parser will try to resolve the location of Schema definition files via a schemaLocation attribute if it is present in the piece of XML or it will try to open the Schema's URI as an URL and read from it. AssertionFailedError: Could not create test ‘test022’ 一、问题 二、解决 1) 2)自己选择合适的JUnit版本>应用>运行【不知道的话,可以都试一下】 Junit. Additional Kotlin assertions can be found as top-level functions in the org. , the mutants with all test cases passed and whose stack traces only include AssertionFailedError, ComparisonFailure, and test cases (Gu et al. Specifically, I needed more knowledge of how systemd manages the startup sequence, especially in determining the order services are started in what is essentially a parallel system. Исправить проблему, если вы видите ниже фрагмент кода public void updateTradesMaintData() throws  2020년 3월 14일 출력이 동일한 경우 AssertionFailedError을. No. AssertionFailedError: No tests found in gameMechanics. framework. 나는 유효하지 않은 매개 변수를 전달하고 메소드 내 에서 NPE를 일으킬 가능성이 있지만 이것이 일어나지 않고 테스트가 실패한다는  Error when unit testing junit. fail(Assert /* * Licensed to the Apache Software Foundation (ASF) under one or more * contributor license agreements. AppError : OpenEdge. 즉, 위 소스 코드를 분석해 보면 assertEquals()에서 AssertionFailedError  junit. Create a java class file named TestJunit1. framework. c. It can be used to test your assumptions about the program. framework. Please note the time in the report does not reflect the time until the VM exit. 1; Java 8; JUnit 5. What's New. failNotEquals(Assert 欢迎关注本站公众号,获取更多程序园信息 junit5中的JUnit Jupiter提供了Assertions类来替代了junit4中的Assert类并且添加了一些新的方法,所以工作过程中完全可以使用A 简介. 报junit. -cp オプションでテストで使用する依存関係(JUnit5 以外)をクラスパスに追加する。. * If no exception is thrown or if an exception of a different type is thrown, the method will fail. 0 K8s 1. Let's use some of the above-mentioned methods in an example. android; android. lang. The filtertrace attribute condenses error and failure stack traces before reporting them. Isnt this a bug?? The text was updated successfully, but these errors were encountered: JUnit 5 makes it easy to assert that an expected exception is thrown with the assertThrows () method. AssertionFailedError: expected:<1> but was:<5>” And if the results for a comprehensive output is successful then the “Success” message in our Console will look like this. dowgiallo. My very first use of JUnit was to build a conformance test kit for the ServiceUI API []. 재 인쇄 할 때 출처를 알려  2013년 4월 29일 AssertionFailedError를 throw해서 에러를 확인하고 있다는 것이다. 2 Last revised February 26, 2007. jupiter. JUnit - API JUnit 中的重要的 API JUnit 中的最重要的程序包是 junit. * @param source test result loaded through a different classloader * @param destination test result reported to the outside framework * @param test initial test used for bootstrapping the integration framework * @return cloned test result */ public static TestResult cloneTestResults(OsgiTestInfoHolder source /**Asserts that executing {@code executable} will throw an exception of type {@code expected}. Throwable t) An error occurred. framework. AccessTest. You can /** * Clones the test result from a TestResult loaded through a different classloader. framework. Assert. NullPointerException to be thrown, but nothing was thrown. . If the device has been initially purchased from a certain Network Provider along with a Voice and Data subscription it is probably Network Locked and you will require an Unlocking Code if you wish to use it with a different carrier SIM card. Java AssertionFailedError - 30 examples found. 'AssertionFailedError' in 'store. AssertionFailedError: Inherits: Progress. AssertionFailedError: Tag 'checkoutTag' in TLD 'demo' is a javax. Instead, create an instance of the data classes with the expected values and use it directly in a single equality assertion. 4. AssertionError: Status expected:<200> but was:<405> at org. 1) in our build script. subpackage. Pastebin. Assertions class. AssertionFailedError: column count (table=image) expected:<2> but was:<3> 検証したいカラム数はimageidとimageの2つだけなのですが、実際のテーブルのカラム数が3であるため、例外がスローされます。 オラクルのエラーの原因と対応:ORA-12899: 列 string の値が大きすぎます(実際: string、最大: string) K8s 1. In order to validate against the XML Schema language Schema validation has to be enabled via the useXMLSchema method of Validator. AssertionFailedError: Some error 1 message at Some failure 1 stack trace </failure> <failure message="  29 Aug 2012 junit. AssertionFailedError: Expected: <null> but… JUnit ist ein Framework zum Testen von Java-Programmen, das besonders für automatisierte Unit-Tests einzelner Units (Klassen oder Methoden) geeignet ist. These are the top rated real world Java examples of AssertionFailedError extracted from open source projects. Closed Find answers to Junit. AssertionFailedError:异常的构造函数:(java. Assert. exception. File: AssertionFailedError. Technologies used: Gradle 5. OSI Certified is a certification mark of the Open Source Initiative. java:97) 2011年8月21日 AssertionFailedError: Method "testValidatePanelistIDHwid" not found at junit. . Java Assertion - Assertion is a statement in java. core. Specifically, I needed more knowledge of how systemd manages the startup sequence, especially in determining the order services are started in what is essentially a parallel system. By using the errorproperty and failureproperty attributes, it is possible to perform setup work (such as starting an external server), execute the test, clean up, and still fail the build in the event of a failure. 19 Dec 2019 AssertionFailedError: An error occurred because the HttpSession has been invalidated. If your phone displays the message ‘This device can be remotely unlocked if eligible. 16% 0. elements. Author(s):, hgarapat. Scratch variables used for temporary storage or indices can be kept short. JUnit - Overview. Assert class). This article describes some common issues and errors that Azure Database Migration Service users can come across. framework. String message) 任意のメッセージを設定するコンストラクタです。 In order to validate against the XML Schema language Schema validation has to be enabled via the useXMLSchema method of Validator. framework. Property-based Testing in Java: From Examples to Properties 6 minute read Test-driven development in OOPLs is mostly focused on example-based test cases aka as “plain old unit tests”. StatTestat junit. junit. lang. Since I started using final first I got rid of many problems. At any rate, I h Android 5. com -- New I think it's a duplicate of #138. springframework. framework. junit. java:47) at junit. userLogin(u));测试就能通过,不知道是什么问题 2017-03-06 源自:使用Struts2+Hibernate开发学 1480 浏览 1 回答 用junit Test运行后,出现如下的错误:junit. static public void assertTrue(boolean condition) {. @Test : This annotation is a replacement of org. AssertionFailedError extracted from open source projects. io. com is the number one paste tool since 2002. Closure 2, 1, 1, 1  29 Aug 2012 junit. 살펴본 기능에 대한 모든 것은 AssertJ Core. channel. framework. reflect. The purpose of a conformance test kit is to help ensure that alternate implementations of the same API are compatible with the API's specification. 835 I/Robocop ( 3771): 20 INFO TEST-UNEXPECTED-FAIL | testShareLink | Exception caught - junit. Writing unit tests with a tool such as JUnit is an essential technique to ensure the quality of your code. softAssertion(MemberTest. fail 基本操作. framework. at MemberTest. Pastebin is a website where you can store text online for a set period of time. AssertionFailedError: No tests found in com. Selenium does not provide any out-of-the box solution for data driven testing but leaves it up to the user to implement this on his own. A dequeue is a linear data structure in … notice. b. Constructs an AssertionError with its detail message derived from the specified object, which is converted to a string as defined in section 15. java version "1. Lang. / tests / camera / src / android / hardware / camera2 / cts / helpers / StaticMetadata. NET Core applications, this is the output when a debugger is attached and is used to continue past both assertions when they fail, or; in release builds of the program, where the call to Debug. 0. Active 2 months ago. flume. framework. java:47) at junit. Contact Information #3940 Sector 23, Gurgaon, Haryana (India) Pin :- 122015. model. UnsupportedOperationException] to be thrown, but instead a [class java. framework. derbynet. framework. 6. In addition to a message and a cause, this class stores the expected and actual values If any assertion of a test will fail, the test will fail. Assert. lang. Release 3. . java:90) Ruby 1. framework 它包含了所有的核心类。一些重要的类列示如下: 序号 _来自jUnit 教程,w3cschool编程狮。 JUnitで単体テストを行っていたところ、前日まで正常に動いてたメソッドで急にinitializationErrorが出てしまいました。 以下、経緯と解決策の覚書きです。 発生事象 Eclipseを使用し、JUnitテストを実行 JUnit Test suites Obviously you have to test your code to get it working in the first place You can do ad hoc testing (running whatever tests occur to you at the moment), or You can build a test suite (a thorough set of tests that can be run at any time) Disadvantages of a test suite It’s a lot of extra programming This is true, but use of a good test framework can help quite a bit You don java. model. apache. AssertionFailedError: No tests found in com. fail(Assert. Chart 26, 1, 1, 1, 2, 2 Closure 1, 1, 1, 1, 3, 3, 0, 0, 1, 8, 2, 1, AssertionFailedError. 1 使用中に、 public class FooTest extends TestCase { @Test public void foo { assertTrue(true); } } がElipse/Maven双方から認識されない現象に遭遇したのでメモ。 この記事は Laravel Advent Calendar 2020 - Qiita 最終日の記事です。. 10. 19. void org. framework. java diff --git a/src/modules/contrib/xmlsitemap/xmlsitemap. Download a PDF of this article. Assert. Assert. apache. junit. 1 (Tikanga) /** * Clones the test result from a TestResult loaded through a different classloader. framework. lang. Unit Test Results Engine Diagnostic Tests Page 1 Summary Tests Failures Errors Success rate Time 19 5 2 63. AssertionFailedError: Forked Java VM exited abnormally. A large number of my junit tests are failing with errors like this:  2 Oct 2013 AssertionFailedError: Expected <1> but was <0>. fail(Assert コマンド プロンプト C:\JavaMaster\bin>java -cp . 2003/12/23 更新 石井 勝. A software test is a piece of software, which executes another piece of software asserting that it behaves in a certain way. BlockedNumbers; Browser; CalendarContract; CalendarContract. S. lang. lang. Please use the Device Unlock Application to unlock the device‘ after you insert a non-accepted SIM card, then your handset is locked to Metro PCS or T-mobile USA. wichina. g. In playgrounds and -Onone builds (the default for Xcode's Debug  Method Summary. 3 K8s 1. java:57) at junit. 5. framework. In most cases, it can be used as a completely transparent drop-in replacement for its parent class. August 20, 2019. 지원해주는 대표적인 기능들을 테스트해보면서 살펴보겠습니다. JXKENG 에 게시 Java. The purpose of a conformance test kit is to help ensure that alternate implementations of the same API are compatible with the API's specification. fail(Assert. framework. assertEquals(false, udao. AssertionFailedError:Method" "not found问题解决 modifier - modifier le code - voir Wikidata (aide) Selenium est un framework de test informatique développé en Java . framework. If a field value itself is an object, it will be recursively compared field by field. AssertionFailedError: No tests found in [package] when using Unit and Mockito(获取junit. 0 K8s 1. All will do the same thing. AssertionFailedError: ожидается: но было:. like I am clicking an button like (+) that is an image view, i am able to click on the button and its getting expand, but problem is when i run it in a loop then next time it does not click on the button and says VIew can not be clicked. Assertion failed! Program:C¥Windows¥system32\\MsiExec. JavaのリフレクションAPIを利用することで、メタデータにアクセスできます。 java. 4. Testing Multithreaded Code. If it isn't it throws. Methodインターフェースを利用してメソッドの取得、メソッドの実行を試してみたいと思います。 Seasarプロジェクトの単体テストは、「S2JUnit4」を使用して行う。 Doltengを使用してプロジェクトを作成した場合は、最初から「S2JUnit4」が使用できる状態になっている。Seasarには、「S2JUnit4」の他に単体テスト機能として、「S2Unit」が提供されているが、今回は割愛する。 1. framework. Fix the failing test. javascript required to view this site. framework. JUnit5 のクラス達は junit-platform-console-standalone-1. * @param source test result loaded through a different classloader * @param destination test result reported to the outside framework * @param test initial test used for bootstrapping the integration framework * @return cloned test result */ public static TestResult cloneTestResults(OsgiTestInfoHolder source Progress. antcontrib. java (junit5-r5. 4. opentest4j. framework. See the NOTICE file distributed with * this work for additional information regarding copyright ownership. 9 spring项目进行junit测试出现如下错误. fail(Assert. AssertionFailedError#setStackTrace() . JUnit 5 We've got the following error:junit. assertionfailederror技术问题等相关问答,请访问CSDN问答。 JUnit4 – AssertionFailedError: No tests found . TestCaseDo at junit. See full list on baeldung. NoSuchFieldError: TRACE at org. With software tests you ensure that certain parts of our software work as expected. junit. Data-Driven testing generally means executing a set of steps with multiple sets of data. animation; android. 002. Please note the time in the report does not reflect the time until the VM exit. framework. 15 Jun 2009 David. jupiter. 2 K8s 1. 1 tag, each tag attribute must be of type java. PHPUnit の拡張. test. isEmpty() method. Unit Testing Database Code by Lasse Koskela. api. toString())(which typically contains the class and detail message of cause). NoClassDefFoundError)(junit. api. Pastebin is a website where you can store text online for a set period of time. JUnitSuite is a class, not a trait, to minimize compile time given there is a slight compiler overhead to mixing in traits compared to extending classes. junit. measured improvement in server performance. JUnit5 のクラス達は junit-platform-console-standalone-1. Name Status Type Time(s) testDefinitlyFails: Failure: This fails! junit. junit. 20. Testing is the process of checking the functionality of an application to ensure it runs as per requirements. AssertionFailedError:使用Unit和Mockito时,[package]中没有找到任何测试) - IT屋-程序员软件开发技术分享社区 我在做CTS测试的时候,log打出了这些junit. derbyTesting. Actual: 1? What is the semantics of the numbers? Design id or User id? What is the context/the containing class? Hard to say. TestSuite$1. framework. Methods inherited from class java. AssertionFailedError. 1 2 3 4 5 6 7 8 9 10 11 12 13 14 15 16 17 18 19 20 21 22 23 24 25 26 27 28 29 30 31 32 33 /** * The Calculator class provides static methods for * arithmetic My very first use of JUnit was to build a conformance test kit for the ServiceUI API []. With assertions enabled, failed assertions cannot be distinguished from failed tests. The class contains tests methods denoted by @Test. Test. lang. Assertions class. JUnit Diff プラグイン ver 1. yy. java:47) at junit. mockpp is a platform independent generic unit testing framework for C++. junit. 16. 0の関数を利用する時にAssertion failed が起きたり起きなかったりするのですがどうしてこれが発生するのでしょうか?この問題を解 Sign in. java (junit5-r5. Assert. AssertionFailedError: Expected :1 Actual :0. Iteration 2. measured improvement in server performance. framework. 0 K8s 1. 1 of The Java™ Language Specification. java:48) Does anyone know what could be causing this and why it only happens on some of the JUnit tests? Thanks,-- Assertion Method The book has now been published and the content of this chapter has likely changed substanstially. AssertionFailedError: This fails! at junitour. Il permet d'interagir avec différents navigateurs web tel que Google Chrome grâce au chromedriver ou Mozilla Firefox avec Gecko de même que le ferait un utilisateur de l'application. To check is given string does not have even blank spaces, use String. reflect. Assertions#fail(java. android / platform / cts / db2127a / . AssertionFailedError: No tests found in a. framework. apache. Element() All Implemented Interfaces and Traits: org. JUnit is a unit testing framework for Java, created by Erich Gamma and Kent Beck. But now Assert throws just AssertionError. 7 リファレンスマニュアル > ライブラリ一覧 > test/unit/assertions ライブラリ > Test::Unit::AssertionFailedErrorクラス  AssertionFailedError: Was expecting a [class java. Annotations Description; 1. javascript required to view this site. Assert is removed and the Trace. reflect. run(RunClassThread. AssertionFailedError: expected:<true> but was:<false> at junit. AssertionFailedError: Forked Java VM exited abnormally. java:1729)' on SUSE Linux / IBM JIT - r9: DERBY-3980: Conflicting select then update with REPEATABLE_READ gives lock timeout instead of deadlock: DERBY-3788: Provide a zero-admin way of updating the statisitcs of an index: DERBY-3258 In this article, we will learn about assertTrue() static method which belongs to JUnit 5 org. I'm trying to write a HD71747: ITEV5CV5 : ASSERTIONFAILEDERROR WHILE SAVING CATALOG BACK TO EN OVIA AFTER RESOLVING PARTS. f7b216f 100644 --- a/src/modules この記事では「 【Java入門】NullPointerExceptionとその回避方法 」といった内容について、誰でも理解できるように解説します。この記事を読めば、あなたの悩みが解決するだけじゃなく、新たな気付きも発見できることでしょう。お悩みの方はぜひご一読ください。 1. 2 K8s 1. import org. annotation 欢迎关注本站公众号,获取更多程序园信息 /* * Licensed to the Apache Software Foundation (ASF) under one or more * contributor license agreements. Please see page 362 of xUnit Test Patterns for the latest information. JUnit 5 introduced a new way of testing for expected exceptions, which is an… If we go through the logs then we will find the given reason as “junit. It's goal is to facilitate developing unit tests in the spirit of Mock Objects for Java, EasyMock and jMock. api. 이 기사는 인터넷에서 수집됩니다. assertTrue(boolean condition) 用于判断一个条件为真,如果为false会抛出异常 2. Return code: 1 10-07 06:42:14. See the NOTICE file distributed with * this work for additional information regarding copyright ownership. lang. If the device has been initially purchased from a certain Network Provider along with a Voice and Data subscription it is probably Network Locked and you will require an Unlocking Code if you wish to use it with a different carrier SIM card. Assertions is a collection of utility methods that support asserting conditions in tests. 0: Used By: 88 artifacts: Central (9) Variables with a large scope should have long names, variables with a small scope can have short names. &nbsp; We'll propose some better alternatives to make our code cleaner and less error-prone. why. fr:8080/cruisecontrol/buildresults/jain-sip?log=log20070609004251 BUILD FAILED Ant /home/cruisecontrol/cruisecontrol In . Consider below example where we are launching google. functionTests. If any of you faced such issue, can you please help me. When we right click and say 'Test File', it runs well. Assertions is a collection of utility methods that support asserting conditions in tests. 8. String) where the message is already formatted and no expected/actual is present org. java AssertionFailedError is a common base class for test-related AssertionErrors. inc index 4f2fba2. These are the mailing lists that have been established for this project. a Karate scenario with VS Code in a Gradle based project, you had to collect everything from a variety of sources. framework. 2020년 2월 19일 AssertionFailedError: [James Age Test] Expecting: <30> to be equal to: <31> but was not. Pastebin. 테스트 메소드명은 test로 시작해야 한다는 글을  25 Mar 2020 AssertionFailedError: The test: 404-error-test was expecting a failure - Error ID: APIKIT:NOT_FOUND but it didn't fail at junit. Actual: 1? What is the semantics of the numbers? Design id or User id? What is the context/the containing class? Hard to say. 9. It uses an in-container approach to run the servlet container, and tests the execution of Action objects as they org. The exception is : junit. api package. Speaking about expected and actual values, if we're going back to the signature, we can see that the first parameter when we're calling the assertEquals needs to be the expected value. There are a few different ways to test that a constructor or other unit in a Java program throws a certain exception. assertTrue(null, condition);. This software is OSI Certified Open Source Software. XplScannerTest. 7 Oct 2010 Junit tests fail junit. optional. The JUnit 5 assertions are static methods in the org. static void: assertEquals(byte expected, byte actual) Junit. testCS4595B_UniqueIndex(AccessTest. 2015년 1월 2일 AssertionFailedError: No tests found in 와 같은 failure가 발생했다. assertFalse(boolean condition) 用于判断一个条件为假 Latex中bib文件编译出错 包含bib文件的Tex编译顺序:首先执行LaTex, 然后 BibTex, 然后再执行LaTex, 最后执行dvi2pdf, 这样就可以生成新的PDF文件了。 システム開発をするにあたり作成したソースコードをテストすることは避けて通れない。しかし効率的にテストを行わないとテストに膨大な時間がかかってしまう。このページではJavaでシステム開発をする時に効率良くテストするためのJUnitというツールを紹介する。 刚上手IntelliJ,导入项目原来写的测试类报错了。 JUnit5才有assertArrayEquals方法,我还以为要手动把JUnit5的jar包放到lib文件夹里,原来 AssertionFailedError: Could not create test ‘test022. framework. cpp Line:100 Expression:0 != pTreeFile For information on how your program can cause an assertion failure,see the java. junit. Throwable cause) Constructs a new throwable with the specified cause and a detail message of (cause==null ? null : cause. Most programmers I meet already know about the benefits of not having 6 classes extended in a row and that final remove this issue. Для демо-примера не используется. Implementation trait for class JUnitSuite, which represents a suite of tests that can be run with either JUnit or ScalaTest. FileNotFoundExceptionTest false java. Getting junit. . 2015年7月29日 見つからないと言われる。 Running tests Test running started junit. accessibilityservice; android. framework 它包含了所有的核心类。一些重要的类列示如下: 序号 _来自jUnit 教程,w3cschool编程狮。 简介. Methodインターフェースを利用してメソッドの取得、メソッドの実行を試してみたいと思います。 用junit Test运行后,出现如下的错误:junit. PHPUnit2_Util_TestDox_ResultPrinter Base class for printers of TestDox documentation. opentest4j. The example code for this guide can be found on GitHub. Please note the time in the report does not reflect the time until the VM exit. /** * Clones the test result from a TestResult loaded through a different classloader. AssertionFailedError: Some error 1 message at Some failure 1 stack trace </failure> <failure message="  . FooTest from the expert community at Experts Exchange The following examples show how to use junit. TestCase. jupiter. framework. 1. testCS4595B_UniqueIndex(AccessTest. 5. 4でopencv3. assertionfailederror


Assertionfailederror